Error C2027 Visual Studio

RECOMMENDED: If you have Windows errors then we strongly recommend that you download and run this (Windows) Repair Tool.

I am working on my game engine and i get some error which i dont know how to fix. I have Camera which have pointer to GameObject but whenever i use him it said that.

Finally, we’ve integrated Xamarin Live with the Console and Error windows in Visual Studio. If you log any output in your app (such as Console.WriteLine), it will now.

Error C2027 use of undefined type 'CString' Visual Studio Languages , Windows Desktop Development > Visual C++. Visual Studio's CString FAQs.

The Visual Studio Code C/C++ extension has had over one million downloads.

Download the Latest Version of Visual Studio at the Official Microsoft® Store.

May 29, 2013. MeshViewer.obj : error LNK2019: unresolved external symbol "void. If it helps, during compilation in Visual Studio 2010 I get in my output.

Feb 09, 2015  · Visual studio 2012 portability. (216): error C2027: use of undefined type ‘std. It’s easier for me to port to older visual studio than to install new visual.

Error 80318 Windows Store Error 803 F7000. Web; News; Img; Video; Shop; Music; Website Navigation. Wednesday, February 24, 2016 1:18. http://www.yaelp.com/s_Windows+Store+Error+803+F7000. Error 803 – how to fix error – WikiFixes. Watch PervertPI – Hot young wife revenge sex on Redtube, home of free POV porn videos starring Gina Valentina Mar 8, 2013. KB article SLN65483 talks about

Developer Community for Visual Studio Product family. This allows diagnostic information about the program to be included in your report

Apr 10, 2017  · Compiler error after switching to Visual Studio. 4a08-8a47-e4d82ad3c444/compiler-error-after-switching-to-visual-studio-2017. error C2027…

Compiling on Windows in Visual C++ Express 2010. fatal error C1083: Cannot open include file: 'ofxNetwork.h': No such file or directory. 1> c:program files ( x86)microsoft visual studio 10.0vcincludestdint.h(19) : see declaration of ' int32_t'. error C2027: use of undefined type 'timeval'

NLog can be downloaded using the NuGet package manager from Microsoft Visual Studio. To install NLog from the NuGet Package. This is a sample Warn.

FindDialog.cpp(2) : fatal error C1083: Cannot open include file: 'FindDialog': No such file or. 1> c:documents and settingsaebiomy documentsvisual studio. FindDialog.cpp(9) : error C2027: use of undefined type 'QLabel'

Compiling with Microsoft Visual Studio 2013 #6. Open caioketo opened this Issue Aug 29, 2014 · 1 comment Comments. Assignees. Error 3 error C2027:.

Compiler Error C2027. Visual Studio 2005 Other Versions Visual Studio 2015 ; Visual Studio 2013 ; Visual Studio 2012; Visual Studio 2010; Visual.

I get error C2027:. error C2027 and error C2227. Ask Question. Browse other questions tagged c++ visual-studio or ask your own question.

c++ – error C2027 and error C2227 – Stack Overflow – I get error C2027:. error C2027 and error C2227. Visual Studio and error C2027: use of undefined type 'rsa_st' in OpenSSL 1.1.0. 0.

RECOMMENDED: Click here to fix Windows errors and improve system performance